{"text_format":"1","workbook":"xlsx","n_sheets":13,"sheets":["Dev","Title","1.Profile","+Prices","+Options","2.Strategy","Calcs","Bio results","3. Out Eco","3. Out Pop","3. Out C&G","3. Out Tab","Eco results"],"not_rendered":{"charts":22,"images":48,"macros":1,"external_links":0,"defined_names":68,"comments":10,"pivot_tables":0},"unopened":[],"bounds":{"document_bytes":16777216,"sheet_cells":100000,"rows_first":2000,"rows_last":500,"rows_between":2000,"halvings":0,"cell_chars":16384,"cell_head_chars":4096},"cells_cut":0,"cells_raw":0,"read":"whole","date_system":"1900"}

{"sheet":"Dev","index":0,"n_rows":93,"n_cols":62,"rows_kept":93,"cut":false,"hidden":false,"merged":[]}
[]
[]
[]
[]
[]
[]
[]
[null,null,null,null,null,null,null,"To start RIM, allow macros "]
{"$rows_left_out":86}
{"sheet":"Title","index":1,"n_rows":108,"n_cols":39,"rows_kept":108,"cut":false,"hidden":false,"merged":[]}
[]
[]
[]
[]
[]
[]
[]
[]
{"$rows_left_out":101}
{"sheet":"1.Profile","index":2,"n_rows":237,"n_cols":46,"rows_kept":237,"cut":false,"hidden":false,"merged":[[55,29,55,31],[56,29,56,31],[58,29,58,31],[233,14,233,16],[235,14,235,16],[157,14,157,16],[191,14,191,16],[192,14,192,16],[193,14,193,16],[194,14,194,16],[196,14,196,16],[230,14,230,16],[231,14,231,16],[232,14,232,16],[114,14,114,16],[115,14,115,16],[116,14,116,16],[117,14,117,16],[119,14,119,16],[152,14,152,16],[153,14,153,16],[154,14,154,16],[155,14,155,16],[148,14,148,16],[149,14,149,16],[236,2,236,3],[71,14,71,16],[72,14,72,16],[75,14,75,16],[76,14,76,16],[77,14,77,16],[78,14,78,16],[80,14,80,16],[228,2,228,3],[229,2,229,3],[230,2,230,3],[232,2,232,3],[233,2,233,3],[235,2,235,3],[222,2,222,3],[223,2,223,3],[224,2,224,3],[226,2,226,3],[226,14,226,16],[227,2,227,3],[227,14,227,16],[197,2,197,3],[216,2,216,3],[217,2,217,3],[218,2,218,3],[220,2,220,3],[221,2,221,3],[189,2,189,3],[190,2,190,3],[191,2,191,3],[193,2,193,3],[194,2,194,3],[196,2,196,3],[183,2,183,3],[184,2,184,3],[185,2,185,3],[187,2,187,3],[187,14,187,16],[188,2,188,3],[188,14,188,16],[158,2,158,3],[177,2,177,3],[178,2,178,3],[179,2,179,3],[181,2,181,3],[182,2,182,3],[150,2,150,3],[151,2,151,3],[152,2,152,3],[154,2,154,3],[155,2,155,3],[157,2,157,3],[144,2,144,3],[145,2,145,3],[146,2,146,3],[148,2,148,3],[149,2,149,3],[120,2,120,3],[138,2,138,3],[139,2,139,3],[140,2,140,3],[142,2,142,3],[143,2,143,3],[112,2,112,3],[113,2,113,3],[114,2,114,3],[116,2,116,3],[117,2,117,3],[119,2,119,3],[107,2,107,3],[108,2,108,3],[110,2,110,3],[110,14,110,16],[111,2,111,3],[111,14,111,16],[100,2,100,3],[101,2,101,3],[102,2,102,3],[104,2,104,3],[105,2,105,3],[106,2,106,3],[81,2,81,3],[25,14,25,16],[26,14,26,16],[29,14,29,16],[30,14,30,16],[31,14,31,16],[32,14,32,16],[34,14,34,16],[73,2,73,3],[74,2,74,3],[75,2,75,3],[77,2,77,3],[78,2,78,3],[80,2,80,3],[66,2,66,3],[67,2,67,3],[68,2,68,3],[69,2,69,3],[71,2,71,3],[72,2,72,3],[34,2,34,3],[35,2,35,3],[61,2,61,3],[62,2,62,3],[63,2,63,3],[65,2,65,3],[26,2,26,3],[27,2,27,3],[28,2,28,3],[29,2,29,3],[31,2,31,3],[32,2,32,3],[15,2,15,3],[19,2,19,3],[25,2,25,3],[16,2,16,3],[17,2,17,3],[20,2,20,3],[21,2,21,3],[22,2,22,3],[23,2,23,3]]}
[]
[]
["1. DEFINE Paddock"]
[]
[null,"Main parameters",null,"Wheat","Barley","Canola","Legume",null,null,null,"Hay","Silage","Bales",null,null,"Sheep"]
[]
[null,null,"Weed-free yields",1.8,1.6,1,1,"t/ha","Production costs",null,250,250,25,"$/ha",null,"Animal Gross Margin "]
[null,null,"Grain prices",380,280,780,450,"$/t","Fodder prices",null,180,180,110,"$/t",null,55,"$/DSE"]
{"$rows_left_out":230}
{"sheet":"+Prices","index":3,"n_rows":212,"n_cols":50,"rows_kept":212,"cut":false,"hidden":false,"merged":[]}
[]
[]
[]
[]
[]
[]
[null,"More Prices…",null,null,null,null,null,null,{"$f":"'1.Profile'!O27&\", \"&'1.Profile'!O26","v":"Susceptible, 2022-LoRF"},null,null,null,null,null,null,null,null,null,null,null,null,null,null,null,null,null,null,null,null,null,null," "]
[]
{"$rows_left_out":205}
{"sheet":"+Options","index":4,"n_rows":236,"n_cols":53,"rows_kept":236,"cut":false,"hidden":false,"merged":[]}
[]
[]
[]
[]
[]
[]
[null,"More Options…",null,null,null,null,null,null,null,{"$f":"'1.Profile'!O27&\", \"&'1.Profile'!O26","v":"Susceptible, 2022-LoRF"}]
[]
{"$rows_left_out":229}
{"sheet":"2.Strategy","index":5,"n_rows":239,"n_cols":48,"rows_kept":239,"cut":false,"hidden":false,"merged":[[5,14,5,16],[12,14,12,15],[13,14,13,15],[7,14,7,15],[8,14,8,15],[9,14,9,15],[10,14,10,15],[11,14,11,15]]}
[null,"2. BUILD Strategy",null,null,null,null,null,null,null,{"$f":"'1.Profile'!O27&\", \"&'1.Profile'!O26","v":"Susceptible, 2022-LoRF"},null,null,"  "]
[]
[null,null,"Choose enterprise","Yr 1","Yr 2","Yr 3","Yr 4","Yr 5","Yr 6","Yr 7","Yr 8","Yr 9","Yr 10"]
[null,null,"and control options:","Wheat","Wheat","Canola","Clover","Clover","Clover","Clover","Wheat","Wheat","Canola",null,"Save & Load",null,null,null,null,null,null,null,null,null,null,null,null,null,null,null,null,null,null,null,null,null,null,null,null,null,null,null,null,null,null,null,null,"Excluded"]
[13,null,"Time of sowing","Wet","Wet","Wet","Delayed","Wet","Wet","Wet","Wet","Wet","Wet"," ","Strategy name: ",null,null,null,null,null,null,null,null,null,null,null,null,null,null,null,null,null,null,null,null,null,null,null,null,null,null,null,null,null,null,null,null,{"$f":"H63","v":"Volunt."}]
[10,null,"Soil preparation",null,null,null,null,null,null,null,null,null,null," ","WWC-graze Lo"]
[1,null,"Knock-down / Double-knock","Glyphosate",null,null,"DoubleK","Paraquat","DoubleK","DoubleK",null,"Glyphosate",null," "]
[4,null,"Pre-emergent herbicide","Triflur+Tria","Sakura","Propyzamide",null,"Triflur+Tria","Propyzamide","Sakura","Boxer Gold","Sakura","Propyzamide"," ","WWC - high"]
{"$rows_left_out":232}
{"sheet":"Calcs","index":6,"n_rows":385,"n_cols":36,"rows_kept":385,"cut":false,"hidden":false,"merged":[]}
[null,"Year",{"$f":"'2.Strategy'!D64","v":"Wheat   1"},{"$f":"'2.Strategy'!E64","v":"Wheat   2"},{"$f":"'2.Strategy'!F64","v":"Canola   3"},{"$f":"'2.Strategy'!G64","v":"Clover   4"},{"$f":"'2.Strategy'!H64","v":"Clover   5"},{"$f":"'2.Strategy'!I64","v":"Clover   6"},{"$f":"'2.Strategy'!J64","v":"Clover   7"},{"$f":"'2.Strategy'!K64","v":"Wheat   8"},{"$f":"'2.Strategy'!L64","v":"Wheat   9"},{"$f":"'2.Strategy'!M64","v":"Canola  10"}]
[]
[null,null,null,null,null,null,null,null,null,null,null,null,null,"SUMMARY - 'CALC' PAGE",null,null,null,null,null,null,"SUMMARY - OTHER PAGES"]
[null,"Table 1. Selected options & enterprises","First table behind the chosen strategy: displays the enterprise code for each option. Their labels are",null,null,null,null,null,null,null,null,null,null,null,{"$f":"B4","v":"Table 1. Selected options & enterprises"}]
[null,null,"sourced from under the strategy table, feeding into the drop-down lists and into the labels of this table.",null,null,null,null,null,null,null,null,null,null,null,{"$f":"N32","v":"Table 1a. Non-selective herbicides counts"},null,null,null,null,null,"DEV",null,"Tutorial templates"]
[null,null,"0=wheat, 1=barley, 2=canola, 3=legumes, 4=volunteer past, 5=clover, 6=cadiz",null,null,null,null,null,null,null,null,null,null,null,{"$f":"N42","v":"Table 1b. Error and sowing handling, herbicides type counts"}]
[1,{"$f":"\"KD/DK: \"&'1.Profile'!C16","v":"KD/DK: Glyphosate"},{"$f":"IF(AND('2.Strategy'!D65=\"yes\",'2.Strategy'!D7='2.Strategy'!$P$75,'2.Strategy'!$P$75<>\"\"),E$184,\"\")","v":""},{"$f":"IF(AND('2.Strategy'!E65=\"yes\",'2.Strategy'!E7='2.Strategy'!$P$75,'2.Strategy'!$P$75<>\"\"),F$184,\"\")","v":""},{"$f":"IF(AND('2.Strategy'!F65=\"yes\",'2.Strategy'!F7='2.Strategy'!$P$75,'2.Strategy'!$P$75<>\"\"),G$184,\"\")","v":""},{"$f":"IF(AND('2.Strategy'!G65=\"yes\",'2.Strategy'!G7='2.Strategy'!$P$75,'2.Strategy'!$P$75<>\"\"),H$184,\"\")","v":""},{"$f":"IF(AND('2.Strategy'!H65=\"yes\",'2.Strategy'!H7='2.Strategy'!$P$75,'2.Strategy'!$P$75<>\"\"),I$184,\"\")","v":""},{"$f":"IF(AND('2.Strategy'!I65=\"yes\",'2.Strategy'!I7='2.Strategy'!$P$75,'2.Strategy'!$P$75<>\"\"),J$184,\"\")","v":""},{"$f":"IF(AND('2.Strategy'!J65=\"yes\",'2.Strategy'!J7='2.Strategy'!$P$75,'2.Strategy'!$P$75<>\"\"),K$184,\"\")","v":""},{"$f":"IF(AND('2.Strategy'!K65=\"yes\",'2.Strategy'!K7='2.Strategy'!$P$75,'2.Strategy'!$P$75<>\"\"),L$184,\"\")","v":""},{"$f":"IF(AND('2.Strategy'!L65=\"yes\",'2.Strategy'!L7='2.Strategy'!$P$75,'2.Strategy'!$P$75<>\"\"),M$184,\"\")","v":""},{"$f":"IF(AND('2.Strategy'!M65=\"yes\",'2.Strategy'!M7='2.Strategy'!$P$75,'2.Strategy'!$P$75<>\"\"),N$184,\"\")","v":""}]
[2,{"$f":"\"KD/DK: \"&'1.Profile'!C17","v":"KD/DK: Paraquat"},{"$f":"IF(AND('2.Strategy'!D65=\"yes\",'2.Strategy'!D7='2.Strategy'!$P$76,'2.Strategy'!$P$76<>\"\"),E$184,\"\")","v":""},{"$f":"IF(AND('2.Strategy'!E65=\"yes\",'2.Strategy'!E7='2.Strategy'!$P$76,'2.Strategy'!$P$76<>\"\"),F$184,\"\")","v":""},{"$f":"IF(AND('2.Strategy'!F65=\"yes\",'2.Strategy'!F7='2.Strategy'!$P$76,'2.Strategy'!$P$76<>\"\"),G$184,\"\")","v":""},{"$f":"IF(AND('2.Strategy'!G65=\"yes\",'2.Strategy'!G7='2.Strategy'!$P$76,'2.Strategy'!$P$76<>\"\"),H$184,\"\")","v":""},{"$f":"IF(AND('2.Strategy'!H65=\"yes\",'2.Strategy'!H7='2.Strategy'!$P$76,'2.Strategy'!$P$76<>\"\"),I$184,\"\")","v":5},{"$f":"IF(AND('2.Strategy'!I65=\"yes\",'2.Strategy'!I7='2.Strategy'!$P$76,'2.Strategy'!$P$76<>\"\"),J$184,\"\")","v":""},{"$f":"IF(AND('2.Strategy'!J65=\"yes\",'2.Strategy'!J7='2.Strategy'!$P$76,'2.Strategy'!$P$76<>\"\"),K$184,\"\")","v":""},{"$f":"IF(AND('2.Strategy'!K65=\"yes\",'2.Strategy'!K7='2.Strategy'!$P$76,'2.Strategy'!$P$76<>\"\"),L$184,\"\")","v":""},{"$f":"IF(AND('2.Strategy'!L65=\"yes\",'2.Strategy'!L7='2.Strategy'!$P$76,'2.Strategy'!$P$76<>\"\"),M$184,\"\")","v":""},{"$f":"IF(AND('2.Strategy'!M65=\"yes\",'2.Strategy'!M7='2.Strategy'!$P$76,'2.Strategy'!$P$76<>\"\"),N$184,\"\")","v":""},null,"Go to",{"$f":"B53","v":"Table 2. Selected RG control (%)"},null,null,null,null,null,"PRICES"]
{"$rows_left_out":378}
{"sheet":"Bio results","index":7,"n_rows":97,"n_cols":26,"rows_kept":97,"cut":false,"hidden":false,"merged":[]}
[null,null,null,{"$f":"'2.Strategy'!D64","v":"Wheat   1"},{"$f":"'2.Strategy'!E64","v":"Wheat   2"},{"$f":"'2.Strategy'!F64","v":"Canola   3"},{"$f":"'2.Strategy'!G64","v":"Clover   4"},{"$f":"'2.Strategy'!H64","v":"Clover   5"},{"$f":"'2.Strategy'!I64","v":"Clover   6"},{"$f":"'2.Strategy'!J64","v":"Clover   7"},{"$f":"'2.Strategy'!K64","v":"Wheat   8"},{"$f":"'2.Strategy'!L64","v":"Wheat   9"},{"$f":"'2.Strategy'!M64","v":"Canola  10"},"\"Dates\"","Active","Plants/m2","Weeds/m2",null,"Strategy A","Plants/m2","Seeds",null,"Strategy B","Plants/m2","Seeds"]
[null,null,"Table 1. Ryegrass plants per m2",null,null,null,null,null,null,null,null,null,null,null,"2001-04-01",0,{"$f":"'Bio results'!D11","v":250}," "]
[null,null,"First chance to seed",{"$f":"D11*Calcs!C151","v":12.5},{"$f":"E11*Calcs!D151","v":2.3309569291847771},{"$f":"F11*Calcs!E151","v":0.32798340585267627},{"$f":"G11*Calcs!F151","v":0.22355595747283302},{"$f":"H11*Calcs!G151","v":1.6345390580158572},{"$f":"I11*Calcs!H151","v":10.299285154389537},{"$f":"J11*Calcs!I151","v":19.24682347996249},{"$f":"K11*Calcs!J151","v":6.1600022893895323},{"$f":"L11*Calcs!K151","v":4.0625363854272818},{"$f":"M11*Calcs!L151","v":11.54471482094811},"2000-05-01","2001-05-01",{"$f":"'Bio results'!D3","v":12.5},{"$f":"'Bio results'!D12","v":237.5}]
[null,null,"10 days after break",{"$f":"D3*Calcs!C164+D12*Calcs!C152*Calcs!C167","v":23.293749999999996},{"$f":"E3*Calcs!D164+E12*Calcs!D152*Calcs!D167","v":2.8711561975233488},{"$f":"F3*Calcs!E164+F12*Calcs!E152*Calcs!E167","v":0.50759531848274808},{"$f":"G3*Calcs!F164+G12*Calcs!F152*Calcs!F167","v":1.3521941770571071},{"$f":"H3*Calcs!G164+H12*Calcs!G152*Calcs!G167","v":10.485568057171722},{"$f":"I3*Calcs!H164+I12*Calcs!H152*Calcs!H167","v":66.069914265408869},{"$f":"J3*Calcs!I164+J12*Calcs!I152*Calcs!I167","v":123.46837262395935},{"$f":"K3*Calcs!J164+K12*Calcs!J152*Calcs!J167","v":9.5333735431164754},{"$f":"L3*Calcs!K164+L12*Calcs!K152*Calcs!K167","v":5.0040291927500533},{"$f":"M3*Calcs!L164+M12*Calcs!L152*Calcs!L167","v":17.866889274769818},"2000-05-10","2001-05-10",{"$f":"'Bio results'!D4","v":23.293749999999996},{"$f":"'Bio results'!D13","v":154.375}]
[null,null,"20 days after break",{"$f":"D4*Calcs!C165+D13*Calcs!C153*Calcs!C167","v":35.02624999999999},{"$f":"E4*Calcs!D165+E13*Calcs!D153*Calcs!D167","v":3.9650742843897646},{"$f":"F4*Calcs!E165+F13*Calcs!E153*Calcs!E167","v":0.73847923703273954},{"$f":"G4*Calcs!F165+G13*Calcs!F153*Calcs!F167","v":0.76183079821938493},{"$f":"H4*Calcs!G165+H13*Calcs!G153*Calcs!G167","v":7.7526187521692096},{"$f":"I4*Calcs!H165+I13*Calcs!H153*Calcs!H167","v":45.546013773999114},{"$f":"J4*Calcs!I165+J13*Calcs!I153*Calcs!I167","v":85.114265134264087},{"$f":"K4*Calcs!J165+K13*Calcs!J153*Calcs!J167","v":13.869707154732236},{"$f":"L4*Calcs!K165+L13*Calcs!K153*Calcs!K167","v":6.9105775184310758},{"$f":"M4*Calcs!L165+M13*Calcs!L153*Calcs!L167","v":25.993791272976242},"2000-05-20","2001-05-20",{"$f":"'Bio results'!D5","v":35.02624999999999},{"$f":"'Bio results'!D14","v":92.625}]
[null,null,"Time for post-emergence spraying",{"$f":"D5*Calcs!C166+D14*Calcs!C154*Calcs!C167","v":41.18581249999999},{"$f":"E5*Calcs!D166+E14*Calcs!D154*Calcs!D167","v":4.5393812799946325},{"$f":"F5*Calcs!E166+F14*Calcs!E154*Calcs!E167","v":0.859693294271485},{"$f":"G5*Calcs!F166+G14*Calcs!F154*Calcs!F167","v":1.1342814106821955},{"$f":"H5*Calcs!G166+H14*Calcs!G154*Calcs!G167","v":11.108633914349141},{"$f":"I5*Calcs!H166+I14*Calcs!H154*Calcs!H167","v":66.692377311927274},{"$f":"J5*Calcs!I166+J14*Calcs!I154*Calcs!I167","v":124.63160251802955},{"$f":"K5*Calcs!J166+K14*Calcs!J154*Calcs!J167","v":16.14628230083051},{"$f":"L5*Calcs!K166+L14*Calcs!K154*Calcs!K167","v":7.9115153894136121},{"$f":"M5*Calcs!L166+M14*Calcs!L154*Calcs!L167","v":30.260414822034615},"2000-06-10","2001-06-10",{"$f":"'Bio results'!D6","v":41.18581249999999},{"$f":"'Bio results'!D15","v":60.206250000000004}]
[null,null,"Early spring",{"$f":"D6*Calcs!C168+D15*Calcs!C155","v":13.149518749999999},{"$f":"E6*Calcs!D168+E15*Calcs!D155","v":1.9110271714125036},{"$f":"F6*Calcs!E168+F15*Calcs!E155","v":1.0966531054148974},{"$f":"G6*Calcs!F168+G15*Calcs!F155","v":1.2342549961327394},{"$f":"H6*Calcs!G168+H15*Calcs!G155","v":11.850489897567863},{"$f":"I6*Calcs!H168+I15*Calcs!H155","v":71.366836620311389},{"$f":"J6*Calcs!I168+J15*Calcs!I155","v":133.36701393970404},{"$f":"K6*Calcs!J168+K15*Calcs!J155","v":20.59672995485721},{"$f":"L6*Calcs!K168+L15*Calcs!K155","v":10.846596364475186},{"$f":"M6*Calcs!L168+M15*Calcs!L155","v":38.601182662299102},"2000-09-01","2001-09-01",{"$f":"'Bio results'!D7","v":13.149518749999999},{"$f":"'Bio results'!D16","v":40.940250000000006}]
[null,null,"Mature ryegrass setting seed setting seed (≈ Sept.)",{"$f":"D7*Calcs!C169*Calcs!C314","v":13.149518749999999},{"$f":"E7*Calcs!D169*Calcs!D314","v":1.9110271714125036},{"$f":"F7*Calcs!E169*Calcs!E314","v":0.10966531054148972},{"$f":"G7*Calcs!F169*Calcs!F314","v":0.61712749806636968},{"$f":"H7*Calcs!G169*Calcs!G314","v":3.5551469692703597},{"$f":"I7*Calcs!H169*Calcs!H314","v":14.273367324062274},{"$f":"J7*Calcs!I169*Calcs!I314","v":2.6673402787940796},{"$f":"K7*Calcs!J169*Calcs!J314","v":20.59672995485721},{"$f":"L7*Calcs!K169*Calcs!K314","v":10.846596364475186},{"$f":"M7*Calcs!L169*Calcs!L314","v":3.8601182662299092},"2000-10-01","2001-10-01",{"$f":"'Bio results'!D8","v":13.149518749999999},{"$f":"'Bio results'!D18","v":171.05679603519553}]
{"$rows_left_out":90}
{"sheet":"3. Out Eco","index":8,"n_rows":39,"n_cols":46,"rows_kept":39,"cut":false,"hidden":false,"merged":[]}
["3. COMPARE Results"]
[]
[]
[]
[]
[]
[]
[null,null,null,null,null,null,null,null,null,null,null,null,null,null,null,null,null,null,"Fixed"]
{"$rows_left_out":32}
{"sheet":"3. Out Pop","index":9,"n_rows":39,"n_cols":46,"rows_kept":39,"cut":false,"hidden":false,"merged":[]}
["3. COMPARE Results"]
[]
[]
[]
[]
[]
[]
[null,null,null,null,null,null,null,null,null,null,null,null,null,null,null,null,null,null,"Fixed"]
{"$rows_left_out":32}
{"sheet":"3. Out C&G","index":10,"n_rows":39,"n_cols":46,"rows_kept":39,"cut":false,"hidden":false,"merged":[]}
["3. COMPARE Results"]
[]
[]
[]
[]
[]
[]
[]
{"$rows_left_out":32}
{"sheet":"3. Out Tab","index":11,"n_rows":81,"n_cols":46,"rows_kept":81,"cut":false,"hidden":false,"merged":[]}
["3. COMPARE Output"]
[]
[]
[null,{"$f":"TEXT(NOW(), \"dd mmmm yyyy\")","v":"10 September 2025"}]
[null,null,null,null,null,{"$f":"IF(AND('Eco results'!Q5='Eco results'!Q23,'Eco results'!P5='Eco results'!P23),\"Current\",\"\")","v":""},{"$f":"IF('Eco results'!Q23<>\"\",'Eco results'!Q23,\"\")","v":""},null,null,null,null,null,null,null,null,null,{"$f":"IF(AND('Eco results'!Q5='Eco results'!Q41,'Eco results'!P5='Eco results'!P41),\"Current\",\"\")","v":""},{"$f":"IF('Eco results'!Q41<>\"\",'Eco results'!Q41,\"\")","v":""}]
[null,"Economical results   ($ /ha)",null,null,"Year",1,2,3,4,5,6,7,8,9,10,null,1,2,3,4,5,6,7,8,9,10]
[null,{"$f":"'Eco results'!P7","v":"Crops"},null,null,null,{"$f":"'Eco results'!Q25","v":0},{"$f":"'Eco results'!R25","v":0},{"$f":"'Eco results'!S25","v":0},{"$f":"'Eco results'!T25","v":0},{"$f":"'Eco results'!U25","v":0},{"$f":"'Eco results'!V25","v":0},{"$f":"'Eco results'!W25","v":0},{"$f":"'Eco results'!X25","v":0},{"$f":"'Eco results'!Y25","v":0},{"$f":"'Eco results'!Z25","v":0},null,{"$f":"'Eco results'!Q43","v":0},{"$f":"'Eco results'!R43","v":0},{"$f":"'Eco results'!S43","v":0},{"$f":"'Eco results'!T43","v":0},{"$f":"'Eco results'!U43","v":0},{"$f":"'Eco results'!V43","v":0},{"$f":"'Eco results'!W43","v":0},{"$f":"'Eco results'!X43","v":0},{"$f":"'Eco results'!Y43","v":0},{"$f":"'Eco results'!Z43","v":0}]
[null,{"$f":"'Eco results'!P8","v":"Sheep"},null,null,null,{"$f":"'Eco results'!Q26","v":0},{"$f":"'Eco results'!R26","v":0},{"$f":"'Eco results'!S26","v":0},{"$f":"'Eco results'!T26","v":0},{"$f":"'Eco results'!U26","v":0},{"$f":"'Eco results'!V26","v":0},{"$f":"'Eco results'!W26","v":0},{"$f":"'Eco results'!X26","v":0},{"$f":"'Eco results'!Y26","v":0},{"$f":"'Eco results'!Z26","v":0},null,{"$f":"'Eco results'!Q44","v":0},{"$f":"'Eco results'!R44","v":0},{"$f":"'Eco results'!S44","v":0},{"$f":"'Eco results'!T44","v":0},{"$f":"'Eco results'!U44","v":0},{"$f":"'Eco results'!V44","v":0},{"$f":"'Eco results'!W44","v":0},{"$f":"'Eco results'!X44","v":0},{"$f":"'Eco results'!Y44","v":0},{"$f":"'Eco results'!Z44","v":0}]
{"$rows_left_out":74}
{"sheet":"Eco results","index":12,"n_rows":78,"n_cols":28,"rows_kept":78,"cut":false,"hidden":false,"merged":[]}
[null,null,null,null,{"$f":"'2.Strategy'!D64","v":"Wheat   1"},{"$f":"'2.Strategy'!E64","v":"Wheat   2"},{"$f":"'2.Strategy'!F64","v":"Canola   3"},{"$f":"'2.Strategy'!G64","v":"Clover   4"},{"$f":"'2.Strategy'!H64","v":"Clover   5"},{"$f":"'2.Strategy'!I64","v":"Clover   6"},{"$f":"'2.Strategy'!J64","v":"Clover   7"},{"$f":"'2.Strategy'!K64","v":"Wheat   8"},{"$f":"'2.Strategy'!L64","v":"Wheat   9"},{"$f":"'2.Strategy'!M64","v":"Canola  10"}]
[null,"Table 1. Receipts"]
[null,"Grain gross receipts ($/ha)",null,null,{"$f":"'Bio results'!D42*'1.Profile'!$D$8+'Bio results'!D43*'1.Profile'!$E$8+'Bio results'!D44*'1.Profile'!$F$8+'Bio results'!D45*'1.Profile'!$G$8","v":631.73356007664984},{"$f":"'Bio results'!E42*'1.Profile'!$D$8+'Bio results'!E43*'1.Profile'!$E$8+'Bio results'!E44*'1.Profile'!$F$8+'Bio results'!E45*'1.Profile'!$G$8","v":642.64961593990438},{"$f":"'Bio results'!F42*'1.Profile'!$D$8+'Bio results'!F43*'1.Profile'!$E$8+'Bio results'!F44*'1.Profile'!$F$8+'Bio results'!F45*'1.Profile'!$G$8","v":761.47829758810974},{"$f":"'Bio results'!G42*'1.Profile'!$D$8+'Bio results'!G43*'1.Profile'!$E$8+'Bio results'!G44*'1.Profile'!$F$8+'Bio results'!G45*'1.Profile'!$G$8","v":0},{"$f":"'Bio results'!H42*'1.Profile'!$D$8+'Bio results'!H43*'1.Profile'!$E$8+'Bio results'!H44*'1.Profile'!$F$8+'Bio results'!H45*'1.Profile'!$G$8","v":0},{"$f":"'Bio results'!I42*'1.Profile'!$D$8+'Bio results'!I43*'1.Profile'!$E$8+'Bio results'!I44*'1.Profile'!$F$8+'Bio results'!I45*'1.Profile'!$G$8","v":0},{"$f":"'Bio results'!J42*'1.Profile'!$D$8+'Bio results'!J43*'1.Profile'!$E$8+'Bio results'!J44*'1.Profile'!$F$8+'Bio results'!J45*'1.Profile'!$G$8","v":0},{"$f":"'Bio results'!K42*'1.Profile'!$D$8+'Bio results'!K43*'1.Profile'!$E$8+'Bio results'!K44*'1.Profile'!$F$8+'Bio results'!K45*'1.Profile'!$G$8","v":765.75441134388643},{"$f":"'Bio results'!L42*'1.Profile'!$D$8+'Bio results'!L43*'1.Profile'!$E$8+'Bio results'!L44*'1.Profile'!$F$8+'Bio results'!L45*'1.Profile'!$G$8","v":712.14814654582835},{"$f":"'Bio results'!M42*'1.Profile'!$D$8+'Bio results'!M43*'1.Profile'!$E$8+'Bio results'!M44*'1.Profile'!$F$8+'Bio results'!M45*'1.Profile'!$G$8","v":679.95581051406486}]
[null,"Hay gross receipts ($/ha)",null,null,{"$f":"IF(Calcs!C35<>\"\",('Bio results'!D46+'Bio results'!D47+'Bio results'!D48+'Bio results'!D49+'Bio results'!D50)*'1.Profile'!$K$8,0)","v":0},{"$f":"IF(Calcs!D35<>\"\",('Bio results'!E46+'Bio results'!E47+'Bio results'!E48+'Bio results'!E49+'Bio results'!E50)*'1.Profile'!$K$8,0)","v":0},{"$f":"IF(Calcs!E35<>\"\",('Bio results'!F46+'Bio results'!F47+'Bio results'!F48+'Bio results'!F49+'Bio results'!F50)*'1.Profile'!$K$8,0)","v":0},{"$f":"IF(Calcs!F35<>\"\",('Bio results'!G46+'Bio results'!G47+'Bio results'!G48+'Bio results'!G49+'Bio results'!G50)*'1.Profile'!$K$8,0)","v":0},{"$f":"IF(Calcs!G35<>\"\",('Bio results'!H46+'Bio results'!H47+'Bio results'!H48+'Bio results'!H49+'Bio results'!H50)*'1.Profile'!$K$8,0)","v":0},{"$f":"IF(Calcs!H35<>\"\",('Bio results'!I46+'Bio results'!I47+'Bio results'!I48+'Bio results'!I49+'Bio results'!I50)*'1.Profile'!$K$8,0)","v":0},{"$f":"IF(Calcs!I35<>\"\",('Bio results'!J46+'Bio results'!J47+'Bio results'!J48+'Bio results'!J49+'Bio results'!J50)*'1.Profile'!$K$8,0)","v":0},{"$f":"IF(Calcs!J35<>\"\",('Bio results'!K46+'Bio results'!K47+'Bio results'!K48+'Bio results'!K49+'Bio results'!K50)*'1.Profile'!$K$8,0)","v":0},{"$f":"IF(Calcs!K35<>\"\",('Bio results'!L46+'Bio results'!L47+'Bio results'!L48+'Bio results'!L49+'Bio results'!L50)*'1.Profile'!$K$8,0)","v":0},{"$f":"IF(Calcs!L35<>\"\",('Bio results'!M46+'Bio results'!M47+'Bio results'!M48+'Bio results'!M49+'Bio results'!M50)*'1.Profile'!$K$8,0)","v":0},null,"ACTIVE"]
[null,"Silage gross receipts ($/ha)",null,null,{"$f":"IF(Calcs!C36<>\"\",('Bio results'!D46+'Bio results'!D47+'Bio results'!D48+'Bio results'!D49+'Bio results'!D50)*'1.Profile'!$L$8,0)","v":0},{"$f":"IF(Calcs!D36<>\"\",('Bio results'!E46+'Bio results'!E47+'Bio results'!E48+'Bio results'!E49+'Bio results'!E50)*'1.Profile'!$L$8,0)","v":0},{"$f":"IF(Calcs!E36<>\"\",('Bio results'!F46+'Bio results'!F47+'Bio results'!F48+'Bio results'!F49+'Bio results'!F50)*'1.Profile'!$L$8,0)","v":0},{"$f":"IF(Calcs!F36<>\"\",('Bio results'!G46+'Bio results'!G47+'Bio results'!G48+'Bio results'!G49+'Bio results'!G50)*'1.Profile'!$L$8,0)","v":0},{"$f":"IF(Calcs!G36<>\"\",('Bio results'!H46+'Bio results'!H47+'Bio results'!H48+'Bio results'!H49+'Bio results'!H50)*'1.Profile'!$L$8,0)","v":0},{"$f":"IF(Calcs!H36<>\"\",('Bio results'!I46+'Bio results'!I47+'Bio results'!I48+'Bio results'!I49+'Bio results'!I50)*'1.Profile'!$L$8,0)","v":0},{"$f":"IF(Calcs!I36<>\"\",('Bio results'!J46+'Bio results'!J47+'Bio results'!J48+'Bio results'!J49+'Bio results'!J50)*'1.Profile'!$L$8,0)","v":0},{"$f":"IF(Calcs!J36<>\"\",('Bio results'!K46+'Bio results'!K47+'Bio results'!K48+'Bio results'!K49+'Bio results'!K50)*'1.Profile'!$L$8,0)","v":0},{"$f":"IF(Calcs!K36<>\"\",('Bio results'!L46+'Bio results'!L47+'Bio results'!L48+'Bio results'!L49+'Bio results'!L50)*'1.Profile'!$L$8,0)","v":0},{"$f":"IF(Calcs!L36<>\"\",('Bio results'!M46+'Bio results'!M47+'Bio results'!M48+'Bio results'!M49+'Bio results'!M50)*'1.Profile'!$L$8,0)","v":0},null,{"$f":"E73","v":101.70134446430011},{"$f":"'1.Profile'!$O$27&\", \"&'1.Profile'!$O$26&\" - \"&'2.Strategy'!$O$6","v":"Susceptible, 2022-LoRF - WWC-graze Lo"}]
[null,"Baling gross receipts ($/ha)",null,null,{"$f":"('Bio results'!D51+'Bio results'!D52+'Bio results'!D53+'Bio results'!D54+Calcs!C343)*'1.Profile'!$M$8","v":0},{"$f":"('Bio results'!E51+'Bio results'!E52+'Bio results'!E53+'Bio results'!E54+Calcs!D343)*'1.Profile'!$M$8","v":0},{"$f":"('Bio results'!F51+'Bio results'!F52+'Bio results'!F53+'Bio results'!F54+Calcs!E343)*'1.Profile'!$M$8","v":0},{"$f":"('Bio results'!G51+'Bio results'!G52+'Bio results'!G53+'Bio results'!G54+Calcs!F343)*'1.Profile'!$M$8","v":0},{"$f":"('Bio results'!H51+'Bio results'!H52+'Bio results'!H53+'Bio results'!H54+Calcs!G343)*'1.Profile'!$M$8","v":0},{"$f":"('Bio results'!I51+'Bio results'!I52+'Bio results'!I53+'Bio results'!I54+Calcs!H343)*'1.Profile'!$M$8","v":0},{"$f":"('Bio results'!J51+'Bio results'!J52+'Bio results'!J53+'Bio results'!J54+Calcs!I343)*'1.Profile'!$M$8","v":0},{"$f":"('Bio results'!K51+'Bio results'!K52+'Bio results'!K53+'Bio results'!K54+Calcs!J343)*'1.Profile'!$M$8","v":0},{"$f":"('Bio results'!L51+'Bio results'!L52+'Bio results'!L53+'Bio results'!L54+Calcs!K343)*'1.Profile'!$M$8","v":0},{"$f":"('Bio results'!M51+'Bio results'!M52+'Bio results'!M53+'Bio results'!M54+Calcs!L343)*'1.Profile'!$M$8","v":0},null,null,{"$f":"E1","v":"Wheat   1"},"Wheat   2","Canola   3","Clover   4","Clover   5","Clover   6","Clover   7","Wheat   8","Wheat   9","Canola  10",null,"TOTAL"]
[null,"Pasture/livestock gross receipts ($/ha)",null,null,{"$f":"Calcs!C328","v":0},{"$f":"Calcs!D328","v":0},{"$f":"Calcs!E328","v":0},{"$f":"Calcs!F328","v":110},{"$f":"Calcs!G328","v":192.5},{"$f":"Calcs!H328","v":247.5},{"$f":"Calcs!I328","v":247.5},{"$f":"Calcs!J328","v":0},{"$f":"Calcs!K328","v":0},{"$f":"Calcs!L328","v":0},null,"Crops",{"$f":"E3","v":631.73356007664984},642.64961593990438,761.47829758810974,0,0,0,0,765.75441134388643,712.14814654582835,679.95581051406486,null,{"$f":"SUM(Q7:Z7)+0.1","v":4193.8198420084436}]
[null,"Total gross receipts ($/ha)",null,null,{"$f":"SUM(E3:E7)","v":631.73356007664984},642.64961593990438,761.47829758810974,110,192.5,247.5,247.5,765.75441134388643,712.14814654582835,679.95581051406486,null,"Sheep",{"$f":"E7","v":0},0,0,110,192.5,247.5,247.5,0,0,0,null,{"$f":"SUM(Q8:Z8)+0.1","v":797.6}]
{"$rows_left_out":70}